BIOMASS ENERGY PRODUCTION/USE
type: Concept
change note: 2012-06-29 13:43:25.0 [tbs1979] insert Definition (id: null text: Refers to the production and use of biomass energy for human consumption. Biomass energy refers to biofuels, a wide range of fuels which are derived from biomass. The term includes solid biomass, liquid fuels and various biogases. language code: en);
change note: 2012-06-26 15:49:32.0 [tbs1979] Insert Concept add broader relation (BIOMASS ENERGY PRODUCTION/USE [99ed30c9-332c-4acf-8620-eab3c67bcc90,40129] - ENERGY PRODUCTION/USE [b73cee46-8e2c-4df9-b1ed-7f0aa98a04ac,40101]);
definition: Refers to the production and use of biomass energy for human consumption. Biomass energy refers to biofuels, a wide range of fuels which are derived from biomass. The term includes solid biomass, liquid fuels and various biogases.
in scheme: sciencekeywords

ENERGY PRODUCTION/USE
type: Concept