Photon/Optical Detectors
type: Concept

MICROSCOPES
type: Concept
change note: 2021-08-05 16:06:18.0 [sritz] insert AltLabel (id: null category: primary text: MICROSCOPES language code: en);
definition: MICROSCOPES are instruments that magnify the image of small objects.
in scheme: instruments