VEMAP
type: Concept
change note: 2017-06-14 16:51:33.0 [sritz] update Definition (The Vegetation-Ecosystem Modeling & Analysis (VEMAP) Project was a multi-institutional, international effort whose goal is to evaluate the sensitivity of terrestrial ecosystem and vegetation processes to altered climate forcing and elevated atmospheric CO2. Phase 1 of the VEMAP project developed a model database of climate, soils, and vegetation. Phase 2 developed a historical (1895-1994) gridded data set of climate (temperature, precipitation, solar radiation, humidity, and wind speed) and transient climate change scenarios based on coupled atmosphere-ocean GCM experiments.);
change note: 2017-06-07 10:42:25.0 [tstevens] update AltLabel (Vegetation-Ecosystem Modeling and Analysis Project);
definition: The Vegetation-Ecosystem Modeling & Analysis (VEMAP) Project was a multi-institutional, international effort whose goal is to evaluate the sensitivity of terrestrial ecosystem and vegetation processes to altered climate forcing and elevated atmospheric CO2. Phase 1 of the VEMAP project developed a model database of climate, soils, and vegetation. Phase 2 developed a historical (1895-1994) gridded data set of climate (temperature, precipitation, solar radiation, humidity, and wind speed) and transient climate change scenarios based on coupled atmosphere-ocean GCM experiments.
in scheme: projects

V - Z
type: Concept