D - F
type: Concept

FINSKEN
type: Concept
definition: FINSKEN, a research project in the Finnish Global Change Research Programme (FIGARE), has developed up-to-date projections of changes in environmental and related factors in Finland during the 21st century and beyond. FINSKEN consists of: * Socio-economic and technological scenarios * Atmospheric composition scenarios * Acid deposition scenarios * Climate scenarios * Sea-level scenarios Summary provided by http://www.finessi.info/finsken/
in scheme: projects