S - U
type: Concept

TROPESS
type: Concept
change note: 2023-01-31 17:19:41.0 [sritz] update Definition (TES has borne witness to a changing trajectory of atmospheric composition in the troposphere and revealed its complex interactions within the broader Earth System Characterizing and predicting this trajectory requires a broad suite of wellcharacterized measurements linking emissions to concentrations in the context of natural and anthropogenic variability. TROPESS will produce long term, Earth Science Data Records (ESDRs) with uncertainties and observation operators pioneered by TES and enabled by the MUlti-SpEctra, MUltiSpEcies, Multi-SEnsors (MUSES) retrieval algorithm and ground data processing system. Promote the dissemination, utilization, and assimiliation of these ESDRs to support scientific and application communities, e.g., IGAC, IPCC. Support the science of Decadal Survey and CEOS Atmospheric Composition Virtual Constellation (AC-VC) missions through a dependable forward stream of composition ESDR from existing and planned LEO instruments. Support NASA activities including fields campaigns, mission formulation, e.g., Observing System Simulation Experiments (OSSES) ©2020 Jet Propulsion Laboratory/California Institute of Technology https://tes.jpl.nasa.gov/tropess/);
change note: 2020-10-09 14:08:27.0 [mmorahan] insert AltLabel (id: null category: primary text: TRopospheric Ozone and its Precursors from Earth System Sounding language code: en); insert Definition (id: null text: TES has borne witness to a changing trajectory of atmospheric composition in the troposphere and revealed its complex interactions within the broader Earth System Characterizing and predicting this trajectory requires a broad suite of wellcharacterized measurements linking emissions to concentrations in the context of natural and anthropogenic variability. TROPESS will produce long term, Earth Science Data Records (ESDRs) with uncertainties and observation operators pioneered by TES and enabled by the MUlti-SpEctra, MUltiSpEcies, Multi-SEnsors (MUSES) retrieval algorithm and ground data processing system. Promote the dissemination, utilization, and assimiliation of these ESDRs to support scientific and application communities, e.g., IGAC, IPCC. Support the science of Decadal Survey and CEOS Atmospheric Composition Virtual Constellation (AC-VC) missions through a dependable forward stream of composition ESDR from existing and planned LEO instruments. Support NASA activities including fields campaigns, mission formulation, e.g., Observing System Simulation Experiments (OSSES) ©2020 Jet Propulsion Laboratory/California Institute of Technology language code: en); insert Resource (id: null type: provider url: http://ceos.org/document_management/Virtual_Constellations/AC-VC/Meetings/AC-VC-16/Day3_O3/3.03_Bowman_v2.pdf?_ga=2.226696724.869748978.1602154667-790369357.1602154667);
change note: 2020-10-09 13:58:50.0 [mmorahan] Insert Concept add broader relation (TROPESS [9adb566d-f4c5-403b-a518-42542aa28c8d,560732] - S - U [4eb1894b-35b4-406b-8864-944a42bc7702,547487]);
definition: TES has borne witness to a changing trajectory of atmospheric composition in the troposphere and revealed its complex interactions within the broader Earth System Characterizing and predicting this trajectory requires a broad suite of wellcharacterized measurements linking emissions to concentrations in the context of natural and anthropogenic variability. TROPESS will produce long term, Earth Science Data Records (ESDRs) with uncertainties and observation operators pioneered by TES and enabled by the MUlti-SpEctra, MUltiSpEcies, Multi-SEnsors (MUSES) retrieval algorithm and ground data processing system. Promote the dissemination, utilization, and assimiliation of these ESDRs to support scientific and application communities, e.g., IGAC, IPCC. Support the science of Decadal Survey and CEOS Atmospheric Composition Virtual Constellation (AC-VC) missions through a dependable forward stream of composition ESDR from existing and planned LEO instruments. Support NASA activities including fields campaigns, mission formulation, e.g., Observing System Simulation Experiments (OSSES) ©2020 Jet Propulsion Laboratory/California Institute of Technology https://tes.jpl.nasa.gov/tropess/
in scheme: projects