ECHO SOUNDERS
type: Concept
change note: 2021-08-04 17:09:01.0 [sritz] insert AltLabel (id: null category: primary text: ECHO SOUNDERS language code: en);
definition: ECHO SOUNDERS are devices that use sound waves to measure the depth of surface water bodies.
in scheme: instruments

Acoustic Sounders
type: Concept