ACADEMIC
type: Concept

KANAZAWA-U/GSNST
type: Concept
definition: The Graduate School of Natural Science and Technology, Kanazawa University, was founded in 1987, and has been reconstructed in 2004 into a new structure, Bukyokuka, which means to place the Graduate School Courses to be in a more important position than ever as well as undergraduate courses by converting all staffs including members of three undergraduate faculties, which are Faculty of Science, Faculty of Pharmaceutical Sciences and Faculty of Engineering into single Graduate School. Summary Provided By: http://www.nst.kanazawa-u.ac.jp/eng/shokai.html
in scheme: providers