COMMERCIAL
type: Concept

SANI/ITA
type: Concept
definition: SANI - INTERNATIONAL TECHNOLOGY ADVISORS INC. (SANI-ITA) is a privately owned Canadian corporation with its head office located in Ontario. The Company provides geomatics services and consulting in geographic information systems (GIS), remote sensing and softcopy photogrammetry. The Corporation is a distributor for Space Imaging Incorporated image products and NuVision Technologies, Inc., and is also the Authorised Training Centre in Canada for the complete suite of ERDAS IMAGINE software products. SANI-ITA has a wealth of experience in surveying, mapping, remote sensing and system design. This includes but is not limited to image processing for change detection, image classification, spatial modelling and visualisation; radar processing for interpretation, elevation extraction and orthoimagery; topological data structuring to support resource and municipal GIS applications; municipal data maintenance using softcopy photogrammetric tools; creation of high resolution elevation models using digital image correlation techniques; and the creation of high resolution panchromatic and true colour digital orthoimagery to support engineering and cadastral applications. Website: "http://www.sani-ita.com/" [Summary provided by SANI ? International Technology Advisors, Inc]
in scheme: providers