Vehicles
type: Concept

EPA GMAP
type: Concept
change note: 2023-07-21 12:22:53.0 [sritz] Insert Concept add broader relation (EPA GMAP [9d4eebe2-de58-40f7-99f8-26c31ac2f7f9,1380230] - Vehicles [8dc44d7b-e349-42ab-860e-18f5acfc1b28,1370479]);
change note: 2023-07-21 12:25:42.0 [sritz] insert Definition (id: null text: The National Enforcement Investigations Center (NEIC) has a mobile air monitoring vehicle, or GMAP, that is equipped with analyzers for methane; benzene, toluene, ethylbenzene, and xylene (BTEX); total volatile organic compounds (VOCs); and meteorological and global positioning system (GPS) equipment. This combination of equipment allows for real-time monitoring and mapping of pollutants while the vehicle is in motion or stationary. The mobile platform can evaluate large geographic areas in very short timeframes to identify emission sources. GMAP can also be used to take stationary measurements at facilities. language code: en);
change note: 2023-07-21 12:23:31.0 [sritz] insert AltLabel (id: null category: primary text: Environmental Protection Agency Geospatial Measurement of Air Pollution language code: en);
definition: The National Enforcement Investigations Center (NEIC) has a mobile air monitoring vehicle, or GMAP, that is equipped with analyzers for methane; benzene, toluene, ethylbenzene, and xylene (BTEX); total volatile organic compounds (VOCs); and meteorological and global positioning system (GPS) equipment. This combination of equipment allows for real-time monitoring and mapping of pollutants while the vehicle is in motion or stationary. The mobile platform can evaluate large geographic areas in very short timeframes to identify emission sources. GMAP can also be used to take stationary measurements at facilities.
in scheme: platforms