COMPOSITION/TEXTURE
type: Concept
change note: 2013-03-21 14:57:17.0 [tbs1979] insert Definition (id: null text: An analysis of the composition and texture of minerals language code: en);
change note: 2013-03-05 13:14:14.0 [tbs1979] Insert Concept add broader relation (COMPOSITION/TEXTURE [9d828679-c6d3-4f74-9489-d9688509a025,83035] - MINERAL PHYSICAL/OPTICAL PROPERTIES [da269095-7270-4a0d-8b43-2c85bd42dd90,83031]);
definition: An analysis of the composition and texture of minerals
in scheme: sciencekeywords

MINERAL PHYSICAL/OPTICAL PROPERTIES
type: Concept