SUSPENDED SOLIDS
type: Concept
change note: 2018-03-07 10:48:31.0 [tstevens] update Definition (Particulate matter suspended in the water column, greater than 0.45 micrometers, as distinguished from dissolved solids which are less than 0.45 micrometers.); update Definition (Adapted from: Webster's College Dictionary. 1991. Random House. );
change note: 2018-03-07 08:09:50.0 [tstevens] Move Concepts delete broader relation (null); add broader relation (SUSPENDED SOLIDS [9d8cb1dd-4b38-4b4e-8532-ab4eb72cd4ae,86789] - SOLIDS [fad79bec-0672-4c71-8910-174c8985a1b9,310631]);
definition: Particulate matter suspended in the water column, greater than 0.45 micrometers, as distinguished from dissolved solids which are less than 0.45 micrometers.
in scheme: sciencekeywords

SOLIDS
type: Concept