ISOTOPES
type: Concept
definition: Isotopes are a form of an element with a certain number of neutrons, for example carbon exists in three isotopes: C12, C13, and C14. Some isotopes are naturally unstable and spontaneously decay at a fixed rate; other isotopes are stable.
in scheme: sciencekeywords

SEA ICE
type: Concept