ACADEMIC
type: Concept

UC-BERKELEY/CED
type: Concept
definition: The Environmental Design Archives is committed to raising awareness of the significant architectural and landscape heritage of Northern California through collecting, preserving, and providing access to the primary records of the built environment of the region and landscaped environment of the world.
in scheme: providers