CTC
type: Concept
definition: CyberTracker Conservation is a non-profit Public Benefit Organisation that promotes the vision of a worldwide environmental monitoring network. Since 1997 CyberTracker has developed and distributed free software for smart phones and PDAs for data gathering and visualization. We also provide Tracker Certification to improve observer reliability.
in scheme: providers

NON-GOVERNMENT/NON-PROFIT ORGANIZATIONS
type: Concept