RECREATIONAL ACTIVITIES/AREAS
type: Concept
change note: 2012-06-28 10:48:32.0 [tbs1979] update Definition (Princeton University ); update Definition (Describes an activity that diverts or amuses or stimulates. It can also be described as an activity that renews health and spirits by enjoyment and relaxation.);
change note: 2012-06-26 14:43:12.0 [tbs1979] Rename Concept update PrefLabel (RECREATIONAL ACTIVITIES/AREAS);
definition: Describes an activity that diverts or amuses or stimulates. It can also be described as an activity that renews health and spirits by enjoyment and relaxation.
in scheme: sciencekeywords

SOCIAL BEHAVIOR
type: Concept