NAMMA
type: Concept
definition: The NASA African Monsoon Multidisciplinary Analyses (NAMMA) campaign is a field research investigation sponsored by the Science Mission Directorate of the National Aeronautics and Space Administration (NASA). This mission will be based in the Cape Verde Islands, 350 miles off the coast of Senegal in west Africa. Summary provided by: http://namma.msfc.nasa.gov/
in scheme: projects

M - O
type: Concept