Imaging Polarimetric SpectroRadiometers
type: Concept

SPEXone
type: Concept
change note: 2023-07-25 10:51:39.0 [tstevens] insert AltLabel (id: null category: primary text: Spectro-polarimeter for Planetary Exploration one language code: en);
change note: 2023-07-25 10:51:09.0 [tstevens] Insert Concept add broader relation (SPEXone [9fdc317f-59a8-43ff-9d36-36e9719a7ea0,1395064] - Imaging Polarimetric SpectroRadiometers [018fded8-a186-45f7-a33a-b7ad5ebb853a,1387583]);
change note: 2023-07-25 10:54:00.0 [tstevens] insert Definition (id: null text: The Plankton, Aerosol, Cloud, and ocean Ecosystem (PACE) mission is scheduled to launch no earlier than 2023. The mission will carry one hyperspectral radiometer (OCI) and two multi-angle polarimeters (HARP2 and SPEXone). PACE's Spectro-polarimeter for Planetary Exploration one (SPEXone) instrument is a multi-angle polarimeter. It measures the intensity, Degree of Linear Polarization (DoLP) and Angle of Linear Polarization (AoLP) of sunlight reflected back from Earth's atmosphere, land surface, and ocean. The focus of the SPEXone development is to achieve a very high accuracy of DoLP measurements, which facilitates accurate characterization of aerosols in the atmosphere. language code: en);
definition: The Plankton, Aerosol, Cloud, and ocean Ecosystem (PACE) mission is scheduled to launch no earlier than 2023. The mission will carry one hyperspectral radiometer (OCI) and two multi-angle polarimeters (HARP2 and SPEXone). PACE's Spectro-polarimeter for Planetary Exploration one (SPEXone) instrument is a multi-angle polarimeter. It measures the intensity, Degree of Linear Polarization (DoLP) and Angle of Linear Polarization (AoLP) of sunlight reflected back from Earth's atmosphere, land surface, and ocean. The focus of the SPEXone development is to achieve a very high accuracy of DoLP measurements, which facilitates accurate characterization of aerosols in the atmosphere.
in scheme: instruments