RESOURCE DEVELOPMENT SITE
type: Concept

SOLAR FARM
type: Concept
change note: 2016-06-15 08:01:45.0 [gee-cee] insert Definition (id: null text: Pertaining to an installation or area of land in which a large number of solar panels are set up in order to generate electricity. language code: en);
change note: 2016-06-15 08:01:19.0 [gee-cee] Insert Concept add broader relation (SOLAR FARM [9ff1f885-108f-40cb-a054-4e076b8d648b,188263] - RESOURCE DEVELOPMENT SITE [8f109871-e6ff-4cef-a5f8-5a3ad981923e,188257]);
definition: Pertaining to an installation or area of land in which a large number of solar panels are set up in order to generate electricity.
in scheme: sciencekeywords