PATCH REEF
type: Concept
change note: 2013-03-29 09:48:02.0 [tbs1979] insert Definition (id: null text: An isolated, comparatively small reef outcrop, usually within a lagoon or embayment, often circular and surrounded by sand or seagrass. Patch reefs are common. language code: en);
change note: 2013-02-18 12:23:12.0 [tbs1979] Insert Concept add broader relation (PATCH REEF [a1451fce-9e69-4f2d-b2cf-27238a7577ce,82565] - CORAL REEFS [dff4d4af-e1e0-4991-884b-a1c088a802b2,82559]);
definition: An isolated, comparatively small reef outcrop, usually within a lagoon or embayment, often circular and surrounded by sand or seagrass. Patch reefs are common.
in scheme: sciencekeywords

CORAL REEFS
type: Concept