USGS
type: Concept

DOI/USGS/CMG/CCWS
type: Concept
definition: The USGS's Coastal and Marine Geology Program's Center for Coastal and Watershed Studies investigates scientific processes related to societal problems arising in coastal and marine environments, including natural hazards, resources, and environmental change. Increased understanding of these topics will provide the basis for: -predicting future coastal erosion, -the fate of wetlands and coral reefs, -accumulation of sediments, -sediment transport and stability, -circulation, -movement of pollution through aqueous environments, -and the locations of economically valuable minerals. The Center works closely with USGS coastal and Marine research centers in Woods Hole, Massachusetts, and Menlo Park, California, and USGS Biology and Water Resources offices around Florida. The Center also works closely with faculty and students of the University of South Florida on problems critical to the mission of the agency. Website: http://coastal.er.usgs.gov/ [Summary provided by the USGS.]
in scheme: providers