Chemical Meters/Analyzers
type: Concept

LI-7700
type: Concept
change note: 2021-08-09 15:10:18.0 [tstevens] insert AltLabel (id: null category: primary text: LI-7700 Open Path CH4 Analyzer language code: en); insert Definition (id: null text: The LI-7700 Open Path CH4 Analyzer features an open sample path that measures methane density in ambient air. The LI-7700 is designed specifically for eddy covariance flux measurements to evaluate methane emissions from the terrestrial landscape. It provides low-maintenance long-term operation in demanding field deployments. language code: en);
change note: 2021-08-09 15:08:40.0 [tstevens] Insert Concept add broader relation (LI-7700 [a225b9d4-8b00-48e1-98e1-68e274cf2ec3,706561] - Chemical Meters/Analyzers [3d25724b-832f-4a61-b0b2-4f2ccecdba94,698163]);
definition: The LI-7700 Open Path CH4 Analyzer features an open sample path that measures methane density in ambient air. The LI-7700 is designed specifically for eddy covariance flux measurements to evaluate methane emissions from the terrestrial landscape. It provides low-maintenance long-term operation in demanding field deployments.
in scheme: instruments