ACADEMIC
type: Concept

DALHOUSIE/BIOLOGY
type: Concept
definition: The Dalhousie Biology Department is a research and teaching oriented department. We maintain research programmes in areas ranging from marine biology to forest tree genetics and bone development.
in scheme: providers