S - U
type: Concept

TEMPO
type: Concept
change note: 2017-11-02 11:52:52.0 [sritz] Insert Concept add broader relation (TEMPO [a2b07b36-b9a8-4f73-a678-5dfb1e0458d3,310273] - S - U [4eb1894b-35b4-406b-8864-944a42bc7702,292861]);
change note: 2023-04-18 16:39:16.0 [sritz] update Definition (https://tempo.si.edu/);
change note: 2017-11-02 11:53:41.0 [sritz] insert AltLabel (id: null category: primary text: Tropospheric Emissions: Monitoring of Pollution language code: en); insert Definition (id: null text: TEMPO is the first Instrument from NASA's Earth Venture Instrument Class Series. The mission will measure air pollution of North America, from Mexico City to the Canadian tar/oil sands, and from the Atlantic to the Pacific, hourly and at high spatial resolution. TEMPO observations are from the geostationary vantage point, flying on a geostationary commercial communications host spacecraft with the goal to launch in 2018. language code: en);
definition: TEMPO is the first Instrument from NASA's Earth Venture Instrument Class Series. The mission will measure air pollution of North America, from Mexico City to the Canadian tar/oil sands, and from the Atlantic to the Pacific, hourly and at high spatial resolution. TEMPO observations are from the geostationary vantage point, flying on a geostationary commercial communications host spacecraft with the goal to launch in 2018.
in scheme: projects