NASA
type: Concept

NASA/LARC/SD/ASDC/MND
type: Concept
change note: 2017-06-12 14:51:27.0 [sritz] update Definition (MY NASA DATA (MND)’s tools allow anyone to access real NASA Earth science data. Through the use of MND’s Live Access Server (LAS) data viewer, you can create a variety of charts, plots, and graphs to explore the Earth system and answer research questions. MY NASA DATA is also ideal for the classroom, offering a large number of lesson plans, tools, and resources. We’re here to bring NASA’s Earth science mission into the hands of teachers, students, researchers and citizen scientists.); update Definition (https://mynasadata.larc.nasa.gov/);
definition: MY NASA DATA (MND)’s tools allow anyone to access real NASA Earth science data. Through the use of MND’s Live Access Server (LAS) data viewer, you can create a variety of charts, plots, and graphs to explore the Earth system and answer research questions. MY NASA DATA is also ideal for the classroom, offering a large number of lesson plans, tools, and resources. We’re here to bring NASA’s Earth science mission into the hands of teachers, students, researchers and citizen scientists.
in scheme: providers