SEDIMENTATION
type: Concept
definition: The process of deposition of loose particulate material, especially by mechanical means, from a state of suspension in water or air.
in scheme: sciencekeywords

MARINE SEDIMENTS
type: Concept