FORESTS
type: Concept

TEMPERATE DECIDUOUS FOREST
type: Concept
change note: 2016-06-13 12:06:40.0 [gee-cee] insert Definition (id: null text: Pertaining to forests consisting of broadleaf deciduous trees found in mid-latitudes. language code: en);
change note: 2016-06-13 12:06:22.0 [gee-cee] Insert Concept add broader relation (TEMPERATE DECIDUOUS FOREST [a59dc6dc-5348-4e8b-aec2-20cdeb38b617,188177] - FORESTS [46e4aaa4-349c-4049-a910-035391360010,83507]);
definition: Pertaining to forests consisting of broadleaf deciduous trees found in mid-latitudes.
in scheme: sciencekeywords