Chemical Meters/Analyzers
type: Concept

POM
type: Concept
change note: 2020-11-12 15:40:46.0 [sritz] insert AltLabel (id: null category: primary text: Personal Ozone Monitor language code: en); insert Definition (id: null text: 2B Tech has taken the next step in miniaturization of UV-based ozone monitors by developing the Personal Ozone Monitor or "POM". The basic POM unit has dimensions of 4 x 3 x 1.5 inches and weighs only 0.8 lb / 1.0 lb without/with battery (360 g / 450 g ). It has a built in GPS so that ozone measurements may be logged continuously along with geographic location. By folding the optical path in the shape of a "U," it was possible to achieve the same path length in the POM as in the Models 202, 205, and 106-L and thus have similar precision and accuracy (~1.5 ppb). language code: en);
change note: 2020-11-12 15:39:34.0 [sritz] Insert Concept add broader relation (POM [a5a12839-2d5b-45c5-aee9-23b3a0da75ce,560758] - Chemical Meters/Analyzers [3d25724b-832f-4a61-b0b2-4f2ccecdba94,543779]);
definition: 2B Tech has taken the next step in miniaturization of UV-based ozone monitors by developing the Personal Ozone Monitor or "POM". The basic POM unit has dimensions of 4 x 3 x 1.5 inches and weighs only 0.8 lb / 1.0 lb without/with battery (360 g / 450 g ). It has a built in GPS so that ozone measurements may be logged continuously along with geographic location. By folding the optical path in the shape of a "U," it was possible to achieve the same path length in the POM as in the Models 202, 205, and 106-L and thus have similar precision and accuracy (~1.5 ppb).
in scheme: instruments