ACADEMIC
type: Concept

UWA/IsoLab
type: Concept
change note: 2015-02-06 11:14:33.0 [aaleman] added new data center insert AltLabel (id: null text: University of Washington, Department of Earth and Space Sciences, IsoLab language code: en);
change note: 2015-02-06 11:11:36.0 [aaleman] Insert Concept add broader relation (UWA/IsoLab [a7b6f0fb-3859-4ed7-9ea0-208130210c56,106725] - ACADEMIC [7700280b-68ee-4644-bf5e-84e7a6adf897,66467]);
definition: IsoLab is a facility specializing in the analysis of light stable isotopes. Our focus has been to use the stable isotopes of hydrogen, carbon, nitrogen, oxygen, and sulfur to help elucidate paleo and modern-day environments. Our core group here at the University of Washington brings together the Departments of Earth and Space Sciences, Atmospheric Sciences, and Biology as well as the interdisciplinary programs: Quaternary Research Center, Astrobiology Program, and Program on Climate Change. We welcome individuals from all departments and from on or off the University of Washington campus to visit our facility, and to take advantage of our expertise. Please contact Andy for more information about use of our services or the relevant faculty regarding possibilities for collaboration. [source: http://isolab.ess.washington.edu/isolab/about-us/people]
in scheme: providers