WIND SPEED
type: Concept
change note: 2021-10-20 15:27:55.0 [tstevens] insert Definition (id: null text: Speed of wind at the surface of the ocean. language code: en);
change note: 2021-10-20 15:27:05.0 [tstevens] Insert Concept add broader relation (WIND SPEED [a7ce84a3-8329-4eb7-b5de-72d2dea8c6bf,778224] - SURFACE WINDS [fbc53539-ce4e-4e3e-bbd2-8270386616b4,776289]);
definition: Speed of wind at the surface of the ocean.
in scheme: sciencekeywords

SURFACE WINDS
type: Concept