MA/MWRA
type: Concept
definition: MWRA is a Massachusetts public authority established by an act of the Legislature in 1984 to provide wholesale water and sewer services to 2.5 million people and more than 5,500 large industrial users in 61 metropolitan Boston communities. For a list of MWRA community support programs, see http://www.mwra.state.ma.us/comsupport/overview.html [Source: "http://www.mwra.state.ma.us/"]
in scheme: providers

MASSACHUSETTS
type: Concept