Vehicles
type: Concept

MIO
type: Concept
change note: 2021-11-18 08:32:01.0 [tstevens] Move Concepts delete broader relation (null); add broader relation (MIO [a8cf26fe-dcfb-462b-ae0e-5d7280ecfa38,826604] - Vehicles [8dc44d7b-e349-42ab-860e-18f5acfc1b28,835888]);
change note: 2021-10-07 17:57:30.0 [sritz] update Definition (http://cedarweb.vsp.ucar.edu/wiki/index.php/Main_Page); delete Resource (null);
definition: The Mobile Ionospheric Observatory was developed to learn more about the vagaries of the ionosphere. It would become the first major project undertaken by the newly established Radio Propagation Laboratory. Group: Platform_Details Entry_ID: MIO Group: Platform_Identification Platform_Category: In Situ Land-based Platforms Platform_Series_or_Entity: SOLAR/SPACE MONITORING STATIONS Short_Name: MIO Long_Name: Mobile Ionospheric Observatory End_Group Group: Synonymous_Platform_Names Short_Name: MIO End_Group Creation_Date: 2007-12-10 Online_Resource: http://www.friendsofcrc.ca/Articles/Hansen-MobileObs/RPLMobileObservatory.html Sample_Image: http://www.friendsofcrc.ca/Articles/Hansen-MobileObs/RPL-Mobile-48-49-s.jpg End_Group
in scheme: platforms