RAIN
type: Concept

FREEZING RAIN
type: Concept
change note: 2014-04-14 14:32:09.0 [128.183.164.42] Move Concepts delete broader relation (null); add broader relation (FREEZING RAIN [a90306f0-353c-4083-941a-0973a6fd6584,86581] - RAIN [09a57dc7-3911-4a65-9f12-b819652b8671,84455]);
definition: A freezing precipitation form where rain that falls in liquid form becomes supercooled and freezes upon impact with cold surfaces (at subfreezing temperatures) to form a coating of glaze upon the ground and exposed objects.
in scheme: sciencekeywords