Jet
type: Concept

NASA DC-8
type: Concept
change note: 2022-02-17 09:12:50.0 [tstevens] update Definition (NASA operates a highly modified Douglas DC-8 jetliner as a flying science laboratory. The aircraft, based at NASA's Dryden Aircraft Operations Facility in Palmdale, Calif., is used to collect data for experiments in support of projects serving the world's scientific community. Federal, state, academic and foreign investigators are among those who use NASA’s DC-8. Data gathered with the aircraft at flight altitude and by remote sensing have been used for studies in archaeology, ecology, geography, hydrology, meteorology, oceanography, volcanology, atmospheric chemistry, cryospheric science, soil science and biology. Four types of missions are flown with the DC-8: sensor development, satellite sensor verification, space vehicle launch or re-entry telemetry data retrieval and optical tracking, and basic research studies of Earth's surface and atmosphere.); update Definition (NASA);
change note: 2019-10-08 12:30:59.0 [sritz] update WeightedRelation (Platform-Instrument); update WeightedRelation (1.0);
change note: 2021-11-17 11:43:32.0 [tstevens] Move Concepts delete broader relation (null); add broader relation (NASA DC-8 [a930c78a-6ed3-4a49-ad2d-bd2c5c36d291,826606] - Jet [5b8e4067-db4e-42d4-b4a5-7de5e683125d,835881]);
change note: 2019-10-08 12:29:31.0 [sritz] insert WeightedRelation (id: null related concept uuid: b0f93e6a-c766-4957-8762-5c7709487459 relationship type: null relationship value: null generated by: null);
change note: 2019-06-26 16:19:00.0 [sritz] update Definition ([Source: https://www.nasa.gov/centers/armstrong/news/FactSheets/FS-050-DFRC.html ] NASA operates a highly modified Douglas DC-8 jetliner as a flying science laboratory. The aircraft, based at NASA's Dryden Aircraft Operations Facility in Palmdale, Calif., is used to collect data for experiments in support of projects serving the world's scientific community. Federal, state, academic and foreign investigators are among those who use NASA’s DC-8. Data gathered with the aircraft at flight altitude and by remote sensing have been used for studies in archaeology, ecology, geography, hydrology, meteorology, oceanography, volcanology, atmospheric chemistry, cryospheric science, soil science and biology. Four types of missions are flown with the DC-8: sensor development, satellite sensor verification, space vehicle launch or re-entry telemetry data retrieval and optical tracking, and basic research studies of Earth's surface and atmosphere. More information: https://www.nasa.gov/centers/armstrong/news/FactSheets/FS-050-DFRC.html Group: Platform_Details Entry_ID: NASA DC-8 Group: Platform_Identification Platform_Category: Aircraft Short_Name: NASA DC-8 Long_Name: NASA Douglas DC-8 End_Group Group: Platform_Associated_Instruments Short_Name: DAWN End_Group Creation_Date: 2012-05-01 Online_Resource: https://www.nasa.gov/centers/armstrong/news/FactSheets/FS-050-DFRC.html Group: Platform_Logistics Primary_Sponsor: USA/NASA End_Group End_Group);
definition: NASA operates a highly modified Douglas DC-8 jetliner as a flying science laboratory. The aircraft, based at NASA's Dryden Aircraft Operations Facility in Palmdale, Calif., is used to collect data for experiments in support of projects serving the world's scientific community. Federal, state, academic and foreign investigators are among those who use NASA’s DC-8. Data gathered with the aircraft at flight altitude and by remote sensing have been used for studies in archaeology, ecology, geography, hydrology, meteorology, oceanography, volcanology, atmospheric chemistry, cryospheric science, soil science and biology. Four types of missions are flown with the DC-8: sensor development, satellite sensor verification, space vehicle launch or re-entry telemetry data retrieval and optical tracking, and basic research studies of Earth's surface and atmosphere.
in scheme: platforms