CCIN
type: Concept
definition: The Canadian Cryospheric Information Network (CCIN) has been developed through a collaborative partnership between the Federal Government (Canadian Space Agency, Environment Canada, Natural Resources Canada), Dr. Ellsworth LeDrew at the University of Waterloo and the private sector (Noetix Research Inc.) over the past decade to provide the data and information management infrastructure for the Canadian cryospheric community. The main objective of the CCIN is to enhance awareness and access to Canadian cryospheric information and related data.
in scheme: providers

CONSORTIA/INSTITUTIONS
type: Concept