ACADEMIC
type: Concept

SU/CSC/KMR
type: Concept
definition: The School of Computer Science and Communication is a fusion of the former departments Nada (Numerical Analysis and Computer Science) and TMH (Speech, Music and Hearing). The new school comprises seven departments: NA(Numerical Analysis), CVAP, CB, TCS (computer Science), MDI (Human-Computer Interaction), Media Technology and Graphic Arts and Speech, Music and Hearing including the unit for Language and Communication. Summary Provided By: http://www.csc.kth.se/om/
in scheme: providers