CHANDLER CIRCULAR COMPONENT
type: Concept
change note: 2013-04-02 10:04:32.0 [tbs1979] insert Definition (id: null text: Also known as the Chandler wobble, is one of several wobbles the earth makes as it rotates on its axis. language code: en);
change note: 2013-02-18 09:20:26.0 [tbs1979] Insert Concept add broader relation (CHANDLER CIRCULAR COMPONENT [a983aad3-c72a-49e8-8de9-e0aaf35e14b3,82381] - POLAR MOTION [c44b078d-ec95-47d5-9a43-ba8475e568d2,62971]);
definition: Also known as the Chandler wobble, is one of several wobbles the earth makes as it rotates on its axis.
in scheme: sciencekeywords

POLAR MOTION
type: Concept