NET RADIOMETERS
type: Concept
change note: 2021-08-05 16:09:33.0 [sritz] insert AltLabel (id: null category: primary text: NET RADIOMETERS language code: en);
definition: NET RADIOMETERS are radiometers designed to measure the difference in irradiance coming form two opposing hemispheric fields of view.
in scheme: instruments

Spectrometers/Radiometers
type: Concept