COMMERCIAL
type: Concept

EII
type: Concept
definition: Earthinfo Inc provides access to various environmental data. Contact Information: Phone: (303) 938-1788 Fax: (303) 938-8183 E-mail: info&#64earthinfo.com Website: "http://www.earthinfo.com/"
in scheme: providers