Current/Wind Meters
type: Concept

RM Young 8600
type: Concept
change note: 2023-07-21 10:45:29.0 [sritz] Insert Concept add broader relation (RM Young 8600 [ab326c9a-bbea-4aec-8aaa-261572ea4862,1380226] - Current/Wind Meters [1b41692e-c7fe-4567-bed9-b938a7400462,1371126]);
change note: 2023-07-21 10:46:01.0 [sritz] insert AltLabel (id: null category: primary text: RM young Model 86000 Ultrasonic Anemometer language code: en);
change note: 2023-07-21 10:46:51.0 [sritz] insert Definition (id: null text: The YOUNG Model 86000 2D Ultrasonic Anemometer offers high performance and low power consumption in a compact size. It is ideal for the most demanding wind sensing applications language code: en);
definition: The YOUNG Model 86000 2D Ultrasonic Anemometer offers high performance and low power consumption in a compact size. It is ideal for the most demanding wind sensing applications
in scheme: instruments