OCEAN CURRENTS
type: Concept

SUBSURFACE CURRENTS
type: Concept
change note: 2021-10-19 12:56:18.0 [tstevens] insert Definition (id: null text: Bulk layer (ocean subsurface) measure of the water flow vector. language code: en);
change note: 2021-10-19 12:55:08.0 [tstevens] Insert Concept add broader relation (SUBSURFACE CURRENTS [abb21298-124f-4f12-92e8-affbb5c8fba8,778205] - OCEAN CURRENTS [510c5f78-e19e-4ce4-b59a-8937aeb84631,776111]);
definition: Bulk layer (ocean subsurface) measure of the water flow vector.
in scheme: sciencekeywords