SPECIES/POPULATION INTERACTIONS
type: Concept

SCAVENGING
type: Concept
definition: Scavenging is the manner of feeding where the animal feeds on dead animal and plant matter.
in scheme: sciencekeywords