ACADEMIC
type: Concept

UAZ/AGLS/OALS/RV
type: Concept
definition: RangeView is just one of several Infomarts within the EOS Data and Information System (EOSDIS) Synergy project. Prototype Infomarts are being implemented to demonstrate how Earth Observing System (EOS) satellite imagery and other commercial data can be used to address real-world problems confronting users, particularly in state, local and tribal government agencies. The EOS Data and Information System (EOSDIS) Synergy project is intended to enhance the efforts of NASA and university researchers around the United States who are investigating potential applications of remote sensing data. NASA sponsors these efforts under a contract with Raytheon, the prime contractor for the development of the EOSDIS Core System. Website: http://rangeview.arizona.edu/About/index.asp Info: Rangeview Project
in scheme: providers