SEDIMENT TRANSPORT
type: Concept

MONADNOCK
type: Concept
change note: 2013-08-20 10:18:33.0 [tbs1979] insert Definition (id: null text: An isolated rock hill, knob, ridge, or small mountain that rises abruptly from a gently sloping or virtually level surrounding plain. language code: en);
change note: 2013-08-05 14:14:17.0 [tbs1979] Insert Concept add broader relation (MONADNOCK [abe3a81a-3bac-450b-8006-304bee055289,105451] - SEDIMENT TRANSPORT [0b5e5a9b-5552-4e41-b1a1-9c01c52dff4b,105445]);
definition: An isolated rock hill, knob, ridge, or small mountain that rises abruptly from a gently sloping or virtually level surrounding plain.
in scheme: sciencekeywords