GASES
type: Concept

DISSOLVED GASES
type: Concept
change note: 2018-03-06 15:45:14.0 [tstevens] update Definition (Elements or compounds of gaseous form, dissolved in water.);
change note: 2018-03-06 15:30:03.0 [tstevens] update Definition (Elements or compounds of gaseous form, dissolved in seawater.); update Definition (Adapted from: Dictionary of Earth Science, 5th ed.. 1997. Sybil Parker, ed. in chief. McGraw-Hill. );
change note: 2018-03-06 15:25:34.0 [tstevens] Move Concepts delete broader relation (null); add broader relation (DISSOLVED GASES [ac933400-3c8c-4db4-ac68-5e8ed06c8336,86729] - GASES [7b98fcc5-4465-45c8-a647-557432276844,310625]);
definition: Elements or compounds of gaseous form, dissolved in water.
in scheme: sciencekeywords