Campbell Scientific CR3000
type: Concept
change note: 2021-05-11 09:26:01.0 [tstevens] insert AltLabel (id: null category: primary text: Campbell Scientific CR3000 Measurement and Control Datalogger language code: en); insert Definition (id: null text: The CR3000 Micrologger supports complex applications with many sensors. It is fast and powerful enough to handle extended eddy-covariance systems with full energy-balance systems. Multiple CR3000s can be configured as a network or units can be deployed individually. language code: en);
change note: 2021-05-11 09:24:48.0 [tstevens] Insert Concept add broader relation (Campbell Scientific CR3000 [accd5364-a684-425d-b064-f681456ee89c,606924] - Recorders/Loggers [ebfff02c-2e5a-476e-aafb-c00167bf2daa,599787]);
definition: The CR3000 Micrologger supports complex applications with many sensors. It is fast and powerful enough to handle extended eddy-covariance systems with full energy-balance systems. Multiple CR3000s can be configured as a network or units can be deployed individually.
in scheme: instruments

Recorders/Loggers
type: Concept