A - C
type: Concept

CURTAIN I-VIII
type: Concept
definition: Curtain I-VIII was a series of experiments from February 1987 to June 1988 used for model initialization of the Regional Acid Deposition Model (RADM).
in scheme: projects