EROSION/SEDIMENTATION
type: Concept

WEATHERING
type: Concept
change note: 2017-03-10 08:54:04.0 [tstevens] update Definition (The destructive processes by which rocks are changed on exposure to atmospheric agents at or near the earth's surface, with little or no transport of the loosened or altered material.); update Definition (Dictionary of Geological Terms, American Geological Institute, 1984. );
definition: The destructive processes by which rocks are changed on exposure to atmospheric agents at or near the earth's surface, with little or no transport of the loosened or altered material.
in scheme: sciencekeywords