LEAF AREA INDEX (LAI)
type: Concept
change note: 2016-06-15 08:49:43.0 [gee-cee] update PrefLabel (LEAF AREA INDEX (LAI));
change note: 2016-06-15 08:47:25.0 [gee-cee] insert Definition (id: null text: The one sided green leaf area per unit ground area in broadleaf canopies, or as the projected needleleaf area per unit ground area in needle canopies. language code: en);
change note: 2016-06-15 08:46:54.0 [gee-cee] Insert Concept add broader relation (LEAF AREA INDEX [b1d65d88-7bd0-491d-91ca-4102b89dc3e7,188277] - VEGETATION INDEX [b7812c71-4b9e-4016-b4ba-dfcdb7e62365,84883]);
definition: The one sided green leaf area per unit ground area in broadleaf canopies, or as the projected needleleaf area per unit ground area in needle canopies.
in scheme: sciencekeywords

VEGETATION INDEX
type: Concept