SWELLS
type: Concept

SWELL DIRECTION
type: Concept
change note: 2021-10-20 15:02:32.0 [tstevens] insert Definition (id: null text: The direction that the swells are coming from. Direction is given on a 16 point compass scale. language code: en);
change note: 2021-10-20 14:58:57.0 [tstevens] Insert Concept add broader relation (SWELL DIRECTION [b23597aa-ccb2-40be-920d-5663769cd502,778218] - SWELLS [4e4d3c18-cdd4-474a-a936-6e127ec526f7,776184]);
definition: The direction that the swells are coming from. Direction is given on a 16 point compass scale.
in scheme: sciencekeywords