DINOFLAGELLATES
type: Concept
change note: 2017-03-15 11:13:40.0 [mgenazzi] Definition added insert Definition (id: null text: Dinoflagellates are protists with two flagella, a traverse flagellum typically contained in the cingulum used for motion and a longitudinal flagellum that acts as a rudder. Dinoflagellates are most common in freshwater and can be harmful as 'red tides'. language code: en);
definition: Dinoflagellates are protists with two flagella, a traverse flagellum typically contained in the cingulum used for motion and a longitudinal flagellum that acts as a rudder. Dinoflagellates are most common in freshwater and can be harmful as 'red tides'.
in scheme: sciencekeywords

MICROALGAE
type: Concept